Target
Retinoic acid receptor beta
Ligand
BDBM50044098
Substrate
Meas. Tech.
ChEMBL_196660 (CHEMBL799695)
EC50
>10000±n/a nM
Citation
 Boehm, MFMcClurg, MRPathirana, CMangelsdorf, DWhite, SKHebert, JWinn, DGoldman, MEHeyman, RA Synthesis of high specific activity [3H]-9-cis-retinoic acid and its application for identifying retinoids with unusual binding properties. J Med Chem 37:408-14 (1994)  
Target
Name:
Retinoic acid receptor beta
Synonyms:
HAP NR1B2 RAR-beta RARB Retinoic acid receptor RXR-alpha/Retinoic acid receptor beta Retinoid receptor
Type:
PROTEIN
Mol. Mass.:
50498.70
Organism:
Homo sapiens (Human)
Description:
ChEMBL_1458015
Residue:
455
  
Inhibitor
Name:
BDBM50044098
Synonyms:
4-[(E)-2-(3-Isopropyl-5,5,8,8-tetramethyl-5,6,7,8-tetrahydro-naphthalen-2-yl)-propenyl]-benzoic acid | CHEMBL424636
Type:
Small organic molecule
Emp. Form.:
C27H34O2
Mol. Mass.:
390.5577
SMILES:
CC(C)c1cc2c(cc1\C(C)=C\c1ccc(cc1)C(O)=O)C(C)(C)CCC2(C)C
: