Target
Retinoic acid receptor RXR-alpha
Ligand
BDBM50045270
Substrate
Meas. Tech.
ChEBML_164865
EC50
1100±n/a nM
Citation
 Jong, LLehmann, JMHobbs, PDHarlev, EHuffman, JCPfahl, MDawson, MI Conformational effects on retinoid receptor selectivity. 1. Effect of 9-double bond geometry on retinoid X receptor activity. J Med Chem 36:2605-13 (1993)  
Target
Name:
Retinoic acid receptor RXR-alpha
Synonyms:
NR2B1 Nuclear receptor subfamily 4 group A member 2 RXRA Retinoic acid receptor RXR-alpha/gamma Retinoid receptor
Type:
PROTEIN
Mol. Mass.:
50820.38
Organism:
Homo sapiens (Human)
Description:
ChEMBL_1456363
Residue:
462
  
Inhibitor
Name:
BDBM50045270
Synonyms:
4-[1-Methyl-2-(5,5,8,8-tetramethyl-5,6,7,8-tetrahydro-naphthalen-2-yl)-vinyl]-benzoic acid | CHEMBL86893
Type:
Small organic molecule
Emp. Form.:
C24H28O2
Mol. Mass.:
348.4779
SMILES:
C\C(=C\c1ccc2c(c1)C(C)(C)CCC2(C)C)c1ccc(cc1)C(O)=O
: