Target
Sphingosine 1-phosphate receptor 5
Ligand
BDBM50499675
Substrate
Meas. Tech.
ChEMBL_1542569 (CHEMBL3744419)
IC50
7.0±n/a nM
Citation
 Hobson, ADHarris, CMvan der Kam, ELTurner, SCAbibi, AAguirre, ALBousquet, PKebede, TKonopacki, DBGintant, GKim, YLarson, KMaull, JWMoore, NSShi, DShrestha, ATang, XZhang, PSarris, KK Discovery of A-971432, An Orally Bioavailable Selective Sphingosine-1-Phosphate Receptor 5 (S1P5) Agonist for the Potential Treatment of Neurodegenerative Disorders. J Med Chem 58:9154-70 (2015)  
Target
Name:
Sphingosine 1-phosphate receptor 5
Synonyms:
EDG8 S1P5 S1PR5_HUMAN Sphingosine 1-phosphate receptor Edg-8
Type:
G Protein-Coupled Receptor (GPCR)
Mol. Mass.:
41796.42
Organism:
Homo sapiens (Human)
Description:
Residue:
398
  
Inhibitor
Name:
BDBM50499675
Synonyms:
CHEMBL3739887
Type:
Small organic molecule
Emp. Form.:
C18H25NO3
Mol. Mass.:
303.396
SMILES:
CCCCCCC(=O)c1ccc(CN2CC(C2)C(O)=O)cc1
: