Target
Death-associated protein kinase 3
Ligand
BDBM50499634
Substrate
Meas. Tech.
ChEMBL_1543023 (CHEMBL3743946)
IC50
>10000±n/a nM
Citation
 Hobson, ADHarris, CMvan der Kam, ELTurner, SCAbibi, AAguirre, ALBousquet, PKebede, TKonopacki, DBGintant, GKim, YLarson, KMaull, JWMoore, NSShi, DShrestha, ATang, XZhang, PSarris, KK Discovery of A-971432, An Orally Bioavailable Selective Sphingosine-1-Phosphate Receptor 5 (S1P5) Agonist for the Potential Treatment of Neurodegenerative Disorders. J Med Chem 58:9154-70 (2015)  
Target
Name:
Death-associated protein kinase 3
Synonyms:
DAP kinase 3 DAPK3 ZIP-kinase | ZIPK
Type:
PROTEIN
Mol. Mass.:
52537.07
Organism:
Homo sapiens (Human)
Description:
ChEMBL_586564
Residue:
454
  
Inhibitor
Name:
BDBM50499634
Synonyms:
CHEMBL3741589
Type:
Small organic molecule
Emp. Form.:
C18H17Cl2NO3
Mol. Mass.:
366.238
SMILES:
OC(=O)C1CN(Cc2ccc(OCc3ccc(Cl)c(Cl)c3)cc2)C1
: