Target
DNA gyrase subunit B
Ligand
BDBM50366824
Substrate
Meas. Tech.
ChEMBL_1549298 (CHEMBL3758003)
IC50
11200±n/a nM
Citation
 Medapi, BMeda, NKulkarni, PYogeeswari, PSriram, D Development of acridine derivatives as selective Mycobacterium tuberculosis DNA gyrase inhibitors. Bioorg Med Chem 24:877-85 (2016)  
Target
Name:
DNA gyrase subunit B
Synonyms:
5.6.2.2 GYRB_MYCTU | gyrB
Type:
PROTEIN
Mol. Mass.:
74087.83
Organism:
Mycobacterium tuberculosis (strain ATCC 25618 / H37Rv)
Description:
ChEMBL_109655
Residue:
675
  
Inhibitor
Name:
BDBM50366824
Synonyms:
Avelox Moxifl-oxacin
Type:
Small organic molecule
Emp. Form.:
C21H24FN3O4
Mol. Mass.:
401.4314
SMILES:
COc1c(N2C[C@@H]3CCCN[C@@H]3C2)c(F)cc2c1n(cc(C(O)=O)c2=O)C1CC1
: