Target
5-hydroxytryptamine receptor 1D
Ligand
BDBM50054973
Substrate
Meas. Tech.
ChEMBL_1723 (CHEMBL616928)
Ki
0.3±n/a nM
Citation
 Halazy, SPerez, MFourrier, CPallard, IPauwels, PJPalmier, CJohn, GWValentin, JPBonnafous, RMartinez, J Serotonin dimers: application of the bivalent ligand approach to the design of new potent and selective 5-HT(1B/1D) agonists. J Med Chem 39:4920-7 (1997)  
Target
Name:
5-hydroxytryptamine receptor 1D
Synonyms:
5-HT-1D 5-HT1D 5HT1D_HUMAN HTR1DA Serotonin (5-HT) receptor | Serotonin Receptor 1D
Type:
G Protein-Coupled Receptor (GPCR)
Mol. Mass.:
41920.63
Organism:
Homo sapiens (Human)
Description:
Receptor binding assays were performed using human clone stably expressed in CHO cells.
Residue:
377
  
Inhibitor
Name:
BDBM50054973
Synonyms:
2-[3-(2-Amino-ethyl)-1H-indol-5-yloxy]-N-(3-{2-[3-(2-amino-ethyl)-1H-indol-5-yloxy]-acetylamino}-propyl)-acetamide | CHEMBL144397
Type:
Small organic molecule
Emp. Form.:
C27H34N6O4
Mol. Mass.:
506.5967
SMILES:
NCCc1c[nH]c2ccc(OCC(=O)NCCCNC(=O)COc3ccc4[nH]cc(CCN)c4c3)cc12
: