Target
5-hydroxytryptamine receptor 1D
Ligand
BDBM50054988
Substrate
Meas. Tech.
ChEMBL_1723 (CHEMBL616928)
Ki
0.09±n/a nM
Citation
 Halazy, SPerez, MFourrier, CPallard, IPauwels, PJPalmier, CJohn, GWValentin, JPBonnafous, RMartinez, J Serotonin dimers: application of the bivalent ligand approach to the design of new potent and selective 5-HT(1B/1D) agonists. J Med Chem 39:4920-7 (1997)  
Target
Name:
5-hydroxytryptamine receptor 1D
Synonyms:
5-HT-1D 5-HT1D 5HT1D_HUMAN HTR1DA Serotonin (5-HT) receptor | Serotonin Receptor 1D
Type:
G Protein-Coupled Receptor (GPCR)
Mol. Mass.:
41920.63
Organism:
Homo sapiens (Human)
Description:
Receptor binding assays were performed using human clone stably expressed in CHO cells.
Residue:
377
  
Inhibitor
Name:
BDBM50054988
Synonyms:
2-[3-(2-Amino-ethyl)-1H-indol-5-yloxy]-N-[4-(4-{2-[3-(2-amino-ethyl)-1H-indol-5-yloxy]-acetyl}-piperazin-1-yl)-phenyl]-acetamide | CHEMBL357478
Type:
Small organic molecule
Emp. Form.:
C34H39N7O4
Mol. Mass.:
609.718
SMILES:
NCCc1c[nH]c2ccc(OCC(=O)Nc3ccc(cc3)N3CCN(CC3)C(=O)COc3ccc4[nH]cc(CCN)c4c3)cc12
: