Target
Tyrosyl-DNA phosphodiesterase 1
Ligand
BDBM50388602
Substrate
Meas. Tech.
ChEMBL_1829129 (CHEMBL4329003)
IC50
1000±n/a nM
Citation
 Zakharenko, ALLuzina, OASokolov, DNKaledin, VINikolin, VPPopova, NAPatel, JZakharova, ODChepanova, AAZafar, AReynisson, JLeung, ELeung, IKHVolcho, KPSalakhutdinov, NFLavrik, OI Novel tyrosyl-DNA phosphodiesterase 1 inhibitors enhance the therapeutic impact of topote?an on in vivo tumor models. Eur J Med Chem 161:581-593 (2019)  
Target
Name:
Tyrosyl-DNA phosphodiesterase 1
Synonyms:
TDP1 Tyrosyl-DNA phosphodiesterase 1 | Tyrosyl-DNA phosphodiesterase 1 (TDP1)
Type:
Enzyme
Mol. Mass.:
68430.66
Organism:
Homo sapiens (Human)
Description:
Q9NUW8
Residue:
608
  
Inhibitor
Name:
BDBM50388602
Synonyms:
FURAMIDINE
Type:
Small organic molecule
Emp. Form.:
C18H16N4O
Mol. Mass.:
304.3458
SMILES:
NC(=N)c1ccc(cc1)-c1ccc(o1)-c1ccc(cc1)C(N)=N
: