Target
Phospholipase D1
Ligand
BDBM87120
Substrate
Meas. Tech.
ChEMBL_1829771 (CHEMBL4329645)
IC50
1500±n/a nM
Citation
 Waterson, AGScott, SAKett, NRBlobaum, ALAlex Brown, HLindsley, CW Isoform selective PLD inhibition by novel, chiral 2,8-diazaspiro[4.5]decan-1-one derivatives. Bioorg Med Chem Lett 28:3670-3673 (2018)  
Target
Name:
Phospholipase D1
Synonyms:
Choline phosphatase 1 PLD1 Phosphatidylcholine-hydrolyzing phospholipase D1 Phospholipase D1 Phospholipase D2 (PLD2) | hPLD1
Type:
Protein
Mol. Mass.:
124219.92
Organism:
Homo sapiens (Human)
Description:
Q13393
Residue:
1074
  
Inhibitor
Name:
BDBM87120
Synonyms:
CHEMBL1254577 N-[2-[1-(3-fluorophenyl)-4-oxidanylidene-1,3,8-triazaspiro[4.5]decan-8-yl]ethyl]naphthalene-2-carboxamide;2,2,2-tris(fluoranyl)ethanoic acid N-[2-[1-(3-fluorophenyl)-4-oxo-1,3,8-triazaspiro[4.5]decan-8-yl]ethyl]naphthalene-2-carboxamide;2,2,2-trifluoroacetic acid VU0364739-1 | cid_46939577
Type:
Small organic molecule
Emp. Form.:
C26H27FN4O2
Mol. Mass.:
446.5166
SMILES:
Fc1cccc(c1)N1CNC(=O)C11CCN(CCNC(=O)c2ccc3ccccc3c2)CC1
: