Target
Beta-hexosaminidase subunit beta
Ligand
BDBM50507475
Substrate
Meas. Tech.
ChEMBL_1830123 (CHEMBL4329997)
Ki
1600±n/a nM
Citation
 Shen, SDong, LChen, WZeng, XLu, HYang, QZhang, J Modification of the Thioglycosyl-Naphthalimides as Potent and Selective Human O-GlcNAcase Inhibitors. ACS Med Chem Lett 9:1241-1246 (2018)  
Target
Name:
Beta-hexosaminidase subunit beta
Synonyms:
Beta-N-acetylhexosaminidase subunit beta Beta-hexosaminidase subunit beta (Hex B) HEXB_HUMAN | Hexosaminidase subunit B
Type:
Enzyme
Mol. Mass.:
63112.58
Organism:
Homo sapiens (Human)
Description:
P07686
Residue:
556
  
Inhibitor
Name:
BDBM50507475
Synonyms:
CHEMBL4435797
Type:
Small organic molecule
Emp. Form.:
C25H30ClN3O7S
Mol. Mass.:
552.04
SMILES:
CC(=O)N[C@@H]1[C@@H](O)[C@H](O)[C@@H](CO)O[C@H]1SCCNCCCN1C(=O)c2cccc3c(Cl)ccc(C1=O)c23
: