Target
Matrix metalloproteinase-14
Ligand
BDBM50063909
Substrate
Meas. Tech.
ChEMBL_217867 (CHEMBL822190)
IC50
2.5±n/a nM
Citation
 Yamamoto, MTsujishita, HHori, NOhishi, YInoue, SIkeda, SOkada, Y Inhibition of membrane-type 1 matrix metalloproteinase by hydroxamate inhibitors: an examination of the subsite pocket. J Med Chem 41:1209-17 (1998)  
Target
Name:
Matrix metalloproteinase-14
Synonyms:
MMP-14 MMP14 MT-MMP 1 MT1MMP Matrix Metalloproteinase-14 (MMP-14) Matrix metalloproteinase-14 Membrane-type matrix metalloproteinase 1 | Membrane-type-1 matrix metalloproteinase
Type:
Protein
Mol. Mass.:
65900.19
Organism:
Homo sapiens (Human)
Description:
P50281
Residue:
582
  
Inhibitor
Name:
BDBM50063909
Synonyms:
(R)-N*4*-Hydroxy-N*1*-((S)-2-methyl-1-methylcarbamoyl-propyl)-2-(3-phenyl-propyl)-succinamide | CHEMBL20043
Type:
Small organic molecule
Emp. Form.:
C19H29N3O4
Mol. Mass.:
363.4513
SMILES:
CNC(=O)[C@@H](NC(=O)[C@H](CCCc1ccccc1)CC(=O)NO)C(C)C
: