Target
Sodium/glucose cotransporter 1
Ligand
BDBM50381554
Substrate
Meas. Tech.
ChEMBL_1843865 (CHEMBL4344292)
EC50
1900±n/a nM
Citation
 Romero, FAJones, CTXu, YFenaux, MHalcomb, RL The Race to Bash NASH: Emerging Targets and Drug Development in a Complex Liver Disease. J Med Chem 63:5031-5073 (2020)  
Target
Name:
Sodium/glucose cotransporter 1
Synonyms:
High affinity sodium-glucose cotransporter Na(+)/glucose cotransporter 1 SGLT1 Sodium-dependent glucose cotransporter 1 (SGLT1) Sodium/glucose cotransporter 1 (SGLT1) | Solute carrier family 5 member 1
Type:
Protein
Mol. Mass.:
73503.78
Organism:
Homo sapiens (Human)
Description:
P13866
Residue:
664
  
Inhibitor
Name:
BDBM50381554
Synonyms:
CHEMBL2018096
Type:
Small organic molecule
Emp. Form.:
C21H21FO5S
Mol. Mass.:
404.452
SMILES:
OC[C@H]1O[C@H]([C@H](O)[C@@H](O)[C@@H]1O)c1ccc(F)c(Cc2cc3ccccc3s2)c1
: