Target
Sodium/glucose cotransporter 1
Ligand
BDBM50511115
Substrate
Meas. Tech.
ChEMBL_1843865 (CHEMBL4344292)
EC50
330±n/a nM
Citation
 Romero, FAJones, CTXu, YFenaux, MHalcomb, RL The Race to Bash NASH: Emerging Targets and Drug Development in a Complex Liver Disease. J Med Chem 63:5031-5073 (2020)  
Target
Name:
Sodium/glucose cotransporter 1
Synonyms:
High affinity sodium-glucose cotransporter Na(+)/glucose cotransporter 1 SGLT1 Sodium-dependent glucose cotransporter 1 (SGLT1) Sodium/glucose cotransporter 1 (SGLT1) | Solute carrier family 5 member 1
Type:
Protein
Mol. Mass.:
73503.78
Organism:
Homo sapiens (Human)
Description:
P13866
Residue:
664
  
Inhibitor
Name:
BDBM50511115
Synonyms:
CHEMBL4552590
Type:
Small organic molecule
Emp. Form.:
C21H24O8
Mol. Mass.:
404.4105
SMILES:
OC[C@H]1O[C@@H](Oc2ccccc2C(=O)CCc2ccc(O)cc2)[C@H](O)[C@@H](O)[C@@H]1O
: