Target
Sodium/glucose cotransporter 1
Ligand
BDBM50315426
Substrate
Meas. Tech.
ChEMBL_1843865 (CHEMBL4344292)
EC50
4000±n/a nM
Citation
 Romero, FAJones, CTXu, YFenaux, MHalcomb, RL The Race to Bash NASH: Emerging Targets and Drug Development in a Complex Liver Disease. J Med Chem 63:5031-5073 (2020)  
Target
Name:
Sodium/glucose cotransporter 1
Synonyms:
High affinity sodium-glucose cotransporter Na(+)/glucose cotransporter 1 SGLT1 Sodium-dependent glucose cotransporter 1 (SGLT1) Sodium/glucose cotransporter 1 (SGLT1) | Solute carrier family 5 member 1
Type:
Protein
Mol. Mass.:
73503.78
Organism:
Homo sapiens (Human)
Description:
P13866
Residue:
664
  
Inhibitor
Name:
BDBM50315426
Synonyms:
(1S)-1,5-Anhydro-1-[5-(4-ethoxybenzyl)-2-methoxy-4-methylphenyl]-1-thio-D-glucitol | CHEMBL1093423
Type:
Small organic molecule
Emp. Form.:
C23H30O6S
Mol. Mass.:
434.546
SMILES:
CCOc1ccc(Cc2cc([C@@H]3S[C@H](CO)[C@@H](O)[C@H](O)[C@H]3O)c(OC)cc2C)cc1
: