Target
Glutamate receptor 4
Ligand
BDBM50211399
Substrate
Meas. Tech.
ChEMBL_1850704 (CHEMBL4351328)
Ki
200±n/a nM
Citation
 Sainas, STemperini, PFarnsworth, JCYi, FMøllerud, SJensen, AANielsen, BPassoni, AKastrup, JSHansen, KBBoschi, DPickering, DSClausen, RPLolli, ML Use of the 4-Hydroxytriazole Moiety as a Bioisosteric Tool in the Development of Ionotropic Glutamate Receptor Ligands. J Med Chem 62:4467-4482 (2019)  
Target
Name:
Glutamate receptor 4
Synonyms:
GRIA4_RAT Glutamate receptor ionotropic, AMPA 4 Gria4
Type:
PROTEIN
Mol. Mass.:
100766.57
Organism:
Rattus norvegicus
Description:
ChEMBL_539474
Residue:
902
  
Inhibitor
Name:
BDBM50211399
Synonyms:
(RS)-2-amino-3-[3-hydroxy-5-(2-benzyl-2H-5-tetrazolyl)-4-isoxazolyl]propionic acid CHEMBL388746
Type:
Small organic molecule
Emp. Form.:
C14H14N6O4
Mol. Mass.:
330.2988
SMILES:
NC(Cc1c(o[nH]c1=O)-c1nnn(Cc2ccccc2)n1)C(O)=O
: