Target
Glutamate receptor 1
Ligand
BDBM50512945
Substrate
Meas. Tech.
ChEMBL_1850701 (CHEMBL4351325)
Ki
22±n/a nM
Citation
 Sainas, STemperini, PFarnsworth, JCYi, FMøllerud, SJensen, AANielsen, BPassoni, AKastrup, JSHansen, KBBoschi, DPickering, DSClausen, RPLolli, ML Use of the 4-Hydroxytriazole Moiety as a Bioisosteric Tool in the Development of Ionotropic Glutamate Receptor Ligands. J Med Chem 62:4467-4482 (2019)  
Target
Name:
Glutamate receptor 1
Synonyms:
AMPA-selective glutamate receptor 1 GluA1 GluR-A Glur1 Gria1
Type:
Protein
Mol. Mass.:
101583.91
Organism:
Rattus norvegicus (Rat)
Description:
P19490
Residue:
907
  
Inhibitor
Name:
BDBM50512945
Synonyms:
(S)-AMPA
Type:
Small organic molecule
Emp. Form.:
C7H10N2O4
Mol. Mass.:
186.1653
SMILES:
Cc1onc(O)c1C[C@H](N)C(O)=O
: