Target
Bromodomain-containing protein 2
Ligand
BDBM50515771
Substrate
Meas. Tech.
ChEMBL_1862515 (CHEMBL4363371)
Kd
1.2±n/a nM
Citation
 Chen, DLu, TYan, ZLu, WZhou, FLyu, XXu, BJiang, HChen, KLuo, CZhao, Y Discovery, structural insight, and bioactivities of BY27 as a selective inhibitor of the second bromodomains of BET proteins. Eur J Med Chem 182:0 (2019)  
Target
Name:
Bromodomain-containing protein 2
Synonyms:
BRD2 Bromodomain and extra-terminal motif (BET) Bromodomain-containing protein 2 (BRD2) RING3
Type:
Protein
Mol. Mass.:
88085.95
Organism:
Homo sapiens (Human)
Description:
P25440
Residue:
801
  
Inhibitor
Name:
BDBM50515771
Synonyms:
CHEMBL4528047
Type:
Small organic molecule
Emp. Form.:
C22H21ClN6
Mol. Mass.:
404.895
SMILES:
Cc1nnc2CC[C@@H](Nc3ccc(Cl)cc3)c3cc(ccc3-n12)-c1cnn(C)c1
: