Target
Acetylcholine receptor subunit epsilon
Ligand
BDBM10404
Substrate
Meas. Tech.
ChEMBL_1867225 (CHEMBL4368200)
IC50
2660±n/a nM
Citation
 Xu, MPeng, YZhu, LWang, SJi, JRakesh, KP Triazole derivatives as inhibitors of Alzheimer's disease: Current developments and structure-activity relationships. Eur J Med Chem 180:656-672 (2019)  
Target
Name:
Acetylcholine receptor subunit epsilon
Synonyms:
ACHE_HUMAN Acetylcholine receptor protein epsilon chain Nicotinic acetylcholine receptor alpha-1/beta-1/delta/epsilon
Type:
PROTEIN
Mol. Mass.:
54686.87
Organism:
Homo sapiens (Human)
Description:
ChEMBL_431077
Residue:
493
  
Inhibitor
Name:
BDBM10404
Synonyms:
(1S,12S,14R)-9-methoxy-4-methyl-11-oxa-4-azatetracyclo[8.6.1.0^{1,12}.0^{6,17}]heptadeca-6,8,10(17),15-tetraen-14-ol GALANTAMINE HYDROBROMIDE Galanthamine Lycoremine Nivaline Reminyl US9586925, Galantamine | galantamine
Type:
Small organic molecule
Emp. Form.:
C17H21NO3
Mol. Mass.:
287.3535
SMILES:
COc1ccc2CN(C)CC[C@@]34C=C[C@H](O)C[C@@H]3Oc1c24
: