Target
Plasminogen
Ligand
BDBM50518243
Substrate
Meas. Tech.
ChEMBL_1871016 (CHEMBL4372183)
Ki
0.660000±n/a nM
Citation
 Swedberg, JEWu, GMahatmanto, TDurek, TCaradoc-Davies, TTWhisstock, JCLaw, RHPCraik, DJ Highly Potent and Selective Plasmin Inhibitors Based on the Sunflower Trypsin Inhibitor-1 Scaffold Attenuate Fibrinolysis in Plasma. J Med Chem 62:552-560 (2019)  
Target
Name:
Plasminogen
Synonyms:
Activation peptide PLG Plasmin Plasmin heavy chain A, short form | Plasmin light chain B
Type:
Enzyme
Mol. Mass.:
90579.18
Organism:
Homo sapiens (Human)
Description:
Residue:
810
  
Inhibitor
Name:
BDBM50518243
Synonyms:
CHEMBL4435567
Type:
Small organic molecule
Emp. Form.:
C74H108N20O17S2
Mol. Mass.:
1613.903
SMILES:
CC[C@H](C)[C@@H]1NC(=O)[C@@H]2CCCN2C(=O)[C@@H]2CCCN2C(=O)[C@H](CCCCN)NC(=O)[C@H](CO)NC(=O)[C@H](CCCCN)NC(=O)[C@H](Cc2c[nH]c3ccccc23)NC(=O)[C@@H]2CSSC[C@H](NC1=O)C(=O)N[C@@H](Cc1ccccc1)C(=O)N1CCC[C@H]1C(=O)N[C@@H](CC(O)=O)C(=O)NCC(=O)N[C@@H](CCCNC(N)=N)C(=O)N2
: