Target
Serine/threonine-protein kinase pim-1
Ligand
BDBM50518504
Substrate
Meas. Tech.
ChEMBL_1871835 (CHEMBL4373002)
IC50
2.3±n/a nM
Citation
 Barberis, CPribish, JTserlin, EGross, ACzekaj, MBarragué, MErdman, PManiar, SJiang, JFire, LPatel, VHebert, ALevit, MWang, ASun, FHuang, SA Discovery of N-substituted 7-azaindoles as Pan-PIM kinases inhibitors - Lead optimization - Part III. Bioorg Med Chem Lett 29:491-495 (2019)  
Target
Name:
Serine/threonine-protein kinase pim-1
Synonyms:
PIM-1 Kinase PIM1_HUMAN Serine/threonine-protein kinase (PIM1) Serine/threonine-protein kinase PIM1 | Serine/threonine-protein kinase pim-1 (PIM1)
Type:
Protein
Mol. Mass.:
35681.82
Organism:
Homo sapiens (Human)
Description:
P11309
Residue:
313
  
Inhibitor
Name:
BDBM50518504
Synonyms:
CHEMBL4466764
Type:
Small organic molecule
Emp. Form.:
C19H20Cl2N4O3
Mol. Mass.:
423.293
SMILES:
NC(=O)c1cc(Cl)c2c(Cl)c(C#CC3COCCO3)n([C@H]3CCCNC3)c2n1
: