Target
Serine/threonine-protein kinase pim-2
Ligand
BDBM50518504
Substrate
Meas. Tech.
ChEMBL_1871836 (CHEMBL4373003)
IC50
8.80±n/a nM
Citation
 Barberis, CPribish, JTserlin, EGross, ACzekaj, MBarragué, MErdman, PManiar, SJiang, JFire, LPatel, VHebert, ALevit, MWang, ASun, FHuang, SA Discovery of N-substituted 7-azaindoles as Pan-PIM kinases inhibitors - Lead optimization - Part III. Bioorg Med Chem Lett 29:491-495 (2019)  
Target
Name:
Serine/threonine-protein kinase pim-2
Synonyms:
PIM2 Pim-2h Serine/threonine-protein kinase PIM | Serine/threonine-protein kinase pim-2 (PIM2)
Type:
Serine/threonine-protein kinase
Mol. Mass.:
34185.93
Organism:
Homo sapiens (Human)
Description:
Q9P1W9
Residue:
311
  
Inhibitor
Name:
BDBM50518504
Synonyms:
CHEMBL4466764
Type:
Small organic molecule
Emp. Form.:
C19H20Cl2N4O3
Mol. Mass.:
423.293
SMILES:
NC(=O)c1cc(Cl)c2c(Cl)c(C#CC3COCCO3)n([C@H]3CCCNC3)c2n1
: