Target
Thymidylate synthase
Ligand
BDBM50073753
Substrate
Meas. Tech.
ChEMBL_209656 (CHEMBL811596)
Ki
>5000±n/a nM
Citation
 Gossett, LSHabeck, LLShackelford, KAMendelsohn, LGGates, SBWorzalla, JFSelf, TDTheobald, KSAndis, SLSchultz, RMShih, C The synthesis and biological activity of a series of 2,4-diaminopyrido[2,3-d]pyrimidine based antifolates as antineoplastic and antiarthritic agents. Bioorg Med Chem Lett 9:75-8 (1999)  
Target
Name:
Thymidylate synthase
Synonyms:
TS TYMS Thymidylate synthase (TS) | Thymidylate synthase/GAR transformylase/AICAR transformylase
Type:
Enzyme
Mol. Mass.:
35718.07
Organism:
Homo sapiens (Human)
Description:
Residue:
313
  
Inhibitor
Name:
BDBM50073753
Synonyms:
(R)-2-({5-[2-(2,4-Diamino-5,6,7,8-tetrahydro-pyrido[2,3-d]pyrimidin-6-yl)-ethyl]-furan-2-carbonyl}-amino)-2-methyl-pentanedioic acid LY-335738
Type:
Small organic molecule
Emp. Form.:
C20H26N6O6
Mol. Mass.:
446.457
SMILES:
C[C@](CCC(O)=O)(NC(=O)c1ccc(CCC2CNc3nc(N)nc(N)c3C2)o1)C(O)=O
: