Target
Dihydrofolate reductase
Ligand
BDBM50073752
Substrate
Meas. Tech.
ChEBML_54286
Ki
0.690000±n/a nM
Citation
 Gossett, LSHabeck, LLShackelford, KAMendelsohn, LGGates, SBWorzalla, JFSelf, TDTheobald, KSAndis, SLSchultz, RMShih, C The synthesis and biological activity of a series of 2,4-diaminopyrido[2,3-d]pyrimidine based antifolates as antineoplastic and antiarthritic agents. Bioorg Med Chem Lett 9:75-8 (1999)  
Target
Name:
Dihydrofolate reductase
Synonyms:
DHFR Dihydrofolate reductase (DHFR) | Tetrahydrofolate dehydrogenase
Type:
Enzyme
Mol. Mass.:
21453.99
Organism:
Homo sapiens (Human)
Description:
Recombinant human DHFR.
Residue:
187
  
Inhibitor
Name:
BDBM50073752
Synonyms:
(R)-2-({5-[2-(2,4-Diamino-5,6,7,8-tetrahydro-pyrido[2,3-d]pyrimidin-6-yl)-ethyl]-thiophene-2-carbonyl}-amino)-2-methyl-pentanedioic acid LY-335580
Type:
Small organic molecule
Emp. Form.:
C20H26N6O5S
Mol. Mass.:
462.523
SMILES:
C[C@](CCC(O)=O)(NC(=O)c1ccc(CCC2CNc3nc(N)nc(N)c3C2)s1)C(O)=O
: