Target
Retinoic acid receptor RXR-gamma
Ligand
BDBM50075366
Substrate
Meas. Tech.
ChEBML_197238
Kd
35±n/a nM
Citation
 Vuligonda, VGarst, MEChandraratna, RA Stereoselective synthesis and receptor activity of conformationally defined retinoid X receptor selective ligands. Bioorg Med Chem Lett 9:589-94 (1999)  
Target
Name:
Retinoic acid receptor RXR-gamma
Synonyms:
NR2B3 RXRG Retinoic acid receptor RXR-gamma Retinoid X receptor gamma/retinoic acid receptor alpha
Type:
PROTEIN
Mol. Mass.:
50878.26
Organism:
Homo sapiens (Human)
Description:
ChEMBL_197216
Residue:
463
  
Inhibitor
Name:
BDBM50075366
Synonyms:
(2E,4E)-3-Methyl-5-{2-[(E)-2-(2,6,6-trimethyl-cyclohex-1-enyl)-vinyl]-phenyl}-penta-2,4-dienoic acid | CHEMBL157333
Type:
Small organic molecule
Emp. Form.:
C23H28O2
Mol. Mass.:
336.4672
SMILES:
C\C(\C=C\c1ccccc1\C=C\C1=C(C)CCCC1(C)C)=C/C(O)=O
: