Target
Pteridine reductase 1
Ligand
BDBM30705
Substrate
Meas. Tech.
ChEMBL_1886551 (CHEMBL4388228)
IC50
94100±n/a nM
Citation
 Linciano, PPozzi, CIacono, LDdi Pisa, FLandi, GBonucci, AGul, SKuzikov, MEllinger, BWitt, GSantarem, NBaptista, CFranco, CMoraes, CBMüller, WWittig, ULuciani, RSesenna, AQuotadamo, AFerrari, SPöhner, ICordeiro-da-Silva, AMangani, SCostantino, LCosti, MP Enhancement of Benzothiazoles as Pteridine Reductase-1 Inhibitors for the Treatment of Trypanosomatidic Infections. J Med Chem 62:3989-4012 (2019)  
Target
Name:
Pteridine reductase 1
Synonyms:
HMTXR PTR1_LEIMA
Type:
PROTEIN
Mol. Mass.:
30459.34
Organism:
Leishmania major
Description:
ChEMBL_1470027
Residue:
288
  
Inhibitor
Name:
BDBM30705
Synonyms:
CHEMBL744 RILUZOLE cid_5070
Type:
Small organic molecule
Emp. Form.:
C8H5F3N2OS
Mol. Mass.:
234.198
SMILES:
Nc1nc2ccc(OC(F)(F)F)cc2s1
: