Target
Insulin-degrading enzyme
Ligand
BDBM34233
Substrate
Meas. Tech.
ChEMBL_1897036 (CHEMBL4399071)
IC50
42±n/a nM
Citation
 Leroux, FBosc, DBeghyn, THermant, PWarenghem, SLandry, VPottiez, VGuillaume, VCharton, JHerledan, AUrata, SLiang, WSheng, LTang, WJDeprez, BDeprez-Poulain, R Identification of ebselen as a potent inhibitor of insulin degrading enzyme by a drug repurposing screening. Eur J Med Chem 179:557-566 (2019)  
Target
Name:
Insulin-degrading enzyme
Synonyms:
Abeta-degrading protease IDE Insulin degrading enzyme (hIDE) Insulin-degrading enzyme Insulysin | insulin-degrading enzyme isoform 1 precursor
Type:
Enzyme Catalytic Domain
Mol. Mass.:
117968.59
Organism:
Homo sapiens (Human)
Description:
P14735
Residue:
1019
  
Inhibitor
Name:
BDBM34233
Synonyms:
2-Phenyl-benzo[d]isoselenazol-3-one 2-phenyl-1,2-benzisoselazol-3(2H)-one 2-phenylbenzo[d][1,2]selenazol-3(2H)-one EBSELEN MLS000028488 cid_3194 | med.21724, Compound 153
Type:
Small organic molecule
Emp. Form.:
C13H9NOSe
Mol. Mass.:
274.18
SMILES:
O=c1n([se]c2ccccc12)-c1ccccc1
: