Target
Insulin-degrading enzyme
Ligand
BDBM50525489
Substrate
Meas. Tech.
ChEMBL_1897040 (CHEMBL4399075)
IC50
50±n/a nM
Citation
 Leroux, FBosc, DBeghyn, THermant, PWarenghem, SLandry, VPottiez, VGuillaume, VCharton, JHerledan, AUrata, SLiang, WSheng, LTang, WJDeprez, BDeprez-Poulain, R Identification of ebselen as a potent inhibitor of insulin degrading enzyme by a drug repurposing screening. Eur J Med Chem 179:557-566 (2019)  
Target
Name:
Insulin-degrading enzyme
Synonyms:
3.4.24.56 Ide Insulin protease Insulinase Mouse Insulin Degrading Enzyme (mIDE)
Type:
Mol. Mass.:
117770.69
Organism:
Mus musculus (Mouse)
Description:
Q9JHR7
Residue:
1019
  
Inhibitor
Name:
BDBM50525489
Synonyms:
CHEMBL4556893
Type:
Small organic molecule
Emp. Form.:
C41H55N7O7
Mol. Mass.:
757.9181
SMILES:
NCCCC[C@@H]1NC(=O)\C=C\C(=O)N[C@@H](CCCCNC(=O)[C@@H](Cc2ccc(cc2)C(=O)c2ccccc2)NC(=O)[C@H](CC2CCCCC2)NC1=O)C(N)=O
: