Target
Insulin-degrading enzyme
Ligand
BDBM50427703
Substrate
Meas. Tech.
ChEMBL_1897038 (CHEMBL4399073)
Ki
1.7±n/a nM
Citation
 Leroux, FBosc, DBeghyn, THermant, PWarenghem, SLandry, VPottiez, VGuillaume, VCharton, JHerledan, AUrata, SLiang, WSheng, LTang, WJDeprez, BDeprez-Poulain, R Identification of ebselen as a potent inhibitor of insulin degrading enzyme by a drug repurposing screening. Eur J Med Chem 179:557-566 (2019)  
Target
Name:
Insulin-degrading enzyme
Synonyms:
Abeta-degrading protease IDE Insulin degrading enzyme (hIDE) Insulin-degrading enzyme Insulysin | insulin-degrading enzyme isoform 1 precursor
Type:
Enzyme Catalytic Domain
Mol. Mass.:
117968.59
Organism:
Homo sapiens (Human)
Description:
P14735
Residue:
1019
  
Inhibitor
Name:
BDBM50427703
Synonyms:
CHEMBL2324220
Type:
Small organic molecule
Emp. Form.:
C37H45N9O8
Mol. Mass.:
743.8087
SMILES:
NC(N)=NCCC[C@H](NC(=O)[C@@H](CC(=O)NO)Cc1ccc2ccccc2c1)C(=O)N[C@@H](Cc1c[nH]c2ccccc12)C(=O)N[C@@H](CCC(O)=O)C(N)=O
: