Target
Peroxisome proliferator-activated receptor gamma
Ligand
BDBM28700
Substrate
Meas. Tech.
ChEMBL_154533 (CHEMBL760254)
EC50
250000±n/a nM
Citation
 Brown, PJWinegar, DAPlunket, KDMoore, LBLewis, MCWilson, JGSundseth, SSKoble, CSWu, ZChapman, JMLehmann, JMKliewer, SAWillson, TM A ureido-thioisobutyric acid (GW9578) is a subtype-selective PPARalpha agonist with potent lipid-lowering activity. J Med Chem 42:3785-8 (1999)  
Target
Name:
Peroxisome proliferator-activated receptor gamma
Synonyms:
Nr1c3 PPAR-gamma Pparg
Type:
PROTEIN
Mol. Mass.:
57593.55
Organism:
Mus musculus
Description:
ChEMBL_1453700
Residue:
505
  
Inhibitor
Name:
BDBM28700
Synonyms:
2-(4-(4-Chlorobenzoyl)phenoxy)-2-methylpropionic acid CHEMBL981 FIBRICOR LF 153 procetofenic acid
Type:
Small organic molecule
Emp. Form.:
C17H15ClO4
Mol. Mass.:
318.752
SMILES:
CC(C)(Oc1ccc(cc1)C(=O)c1ccc(Cl)cc1)C(O)=O
: