Target
1-deoxy-D-xylulose 5-phosphate reductoisomerase
Ligand
BDBM50528593
Substrate
Meas. Tech.
ChEMBL_1905460 (CHEMBL4407818)
IC50
110±n/a nM
Citation
 Lienau, CGräwert, TAlves Avelar, LAIllarionov, BHeld, JKnaab, TCLungerich, Bvan Geelen, LMeier, DGeissler, SCynis, HRiederer, UBuchholz, MKalscheuer, RBacher, AMordmüller, BFischer, MKurz, T Novel reverse thia-analogs of fosmidomycin: Synthesis and antiplasmodial activity. Eur J Med Chem 181:0 (2019)  
Target
Name:
1-deoxy-D-xylulose 5-phosphate reductoisomerase
Synonyms:
DXR_MYCTU | dxr
Type:
PROTEIN
Mol. Mass.:
42846.92
Organism:
Mycobacterium tuberculosis
Description:
ChEMBL_1474510
Residue:
413
  
Inhibitor
Name:
BDBM50528593
Synonyms:
CHEMBL4590343
Type:
Small organic molecule
Emp. Form.:
C10H12F2NO5PS
Mol. Mass.:
327.242
SMILES:
CN(O)C(=O)CSC(c1cc(F)cc(F)c1)P(O)(O)=O
: