Target
1-deoxy-D-xylulose 5-phosphate reductoisomerase
Ligand
BDBM50528598
Substrate
Meas. Tech.
ChEMBL_1905459 (CHEMBL4407817)
IC50
22±n/a nM
Citation
 Lienau, CGräwert, TAlves Avelar, LAIllarionov, BHeld, JKnaab, TCLungerich, Bvan Geelen, LMeier, DGeissler, SCynis, HRiederer, UBuchholz, MKalscheuer, RBacher, AMordmüller, BFischer, MKurz, T Novel reverse thia-analogs of fosmidomycin: Synthesis and antiplasmodial activity. Eur J Med Chem 181:0 (2019)  
Target
Name:
1-deoxy-D-xylulose 5-phosphate reductoisomerase
Synonyms:
1-Deoxy-D-xylulose 5-phosphate reductoisomerase (DXP) 1-deoxy-D-xylulose 5-phosphate reductoisomerase (DXR) DXP reductoisomerase dxr yaeM
Type:
Protein
Mol. Mass.:
43384.52
Organism:
Escherichia coli
Description:
P45568
Residue:
398
  
Inhibitor
Name:
BDBM50528598
Synonyms:
CHEMBL4474216
Type:
Small organic molecule
Emp. Form.:
C10H14NO5PS2
Mol. Mass.:
323.326
SMILES:
CSc1ccc(cc1)C(SCC(=O)NO)P(O)(O)=O
: