Target
Acetylcholinesterase
Ligand
BDBM50130210
Substrate
Meas. Tech.
ChEMBL_1912674 (CHEMBL4415257)
IC50
1400±n/a nM
Citation
 Dai, WSandoval, ITCai, SSmith, KADelacruz, RGCBoyd, KAMills, JJJones, DACichewicz, RH Cholinesterase Inhibitory Arisugacins L-Q from a  J Nat Prod 82:2627-2637 (2019)  
Target
Name:
Acetylcholinesterase
Synonyms:
ACES_ELEEL Acetylcholinesterase (EeAChE) | ache
Type:
Enzyme
Mol. Mass.:
71812.79
Organism:
Electrophorus electricus (Electric eel)
Description:
Residue:
633
  
Inhibitor
Name:
BDBM50130210
Synonyms:
CHEMBL3632852
Type:
Small organic molecule
Emp. Form.:
C27H32O6
Mol. Mass.:
452.5394
SMILES:
[H][C@]12Cc3c(O[C@]1(C)CC[C@@]1(O)C(C)(C)C(=O)CC[C@]21C)cc(oc3=O)-c1ccc(OC)cc1
: