Target
Acetylcholinesterase
Ligand
BDBM50130206
Substrate
Meas. Tech.
ChEMBL_1912674 (CHEMBL4415257)
IC50
>100000±n/a nM
Citation
 Dai, WSandoval, ITCai, SSmith, KADelacruz, RGCBoyd, KAMills, JJJones, DACichewicz, RH Cholinesterase Inhibitory Arisugacins L-Q from a  J Nat Prod 82:2627-2637 (2019)  
Target
Name:
Acetylcholinesterase
Synonyms:
ACES_ELEEL Acetylcholinesterase (EeAChE) | ache
Type:
Enzyme
Mol. Mass.:
71812.79
Organism:
Electrophorus electricus (Electric eel)
Description:
Residue:
633
  
Inhibitor
Name:
BDBM50130206
Synonyms:
CHEMBL3632856
Type:
Small organic molecule
Emp. Form.:
C27H32O5
Mol. Mass.:
436.54
SMILES:
[H][C@@]12CC[C@@]3(C)Oc4cc(oc(=O)c4C[C@]3([H])[C@@]1(C)CCC(=O)C2(C)C)-c1ccc(OC)cc1
: