Target
Acetylcholinesterase
Ligand
BDBM50259953
Substrate
Meas. Tech.
ChEMBL_1921317 (CHEMBL4424162)
IC50
35700±n/a nM
Citation
 Baek, SCKang, MGPark, JELee, JPLee, HRyu, HWPark, CMPark, DCho, MLOh, SRKim, H Osthenol, a prenylated coumarin, as a monoamine oxidase A inhibitor with high selectivity. Bioorg Med Chem Lett 29:839-843 (2019)  
Target
Name:
Acetylcholinesterase
Synonyms:
ACES_ELEEL Acetylcholinesterase (EeAChE) | ache
Type:
Enzyme
Mol. Mass.:
71812.79
Organism:
Electrophorus electricus (Electric eel)
Description:
Residue:
633
  
Inhibitor
Name:
BDBM50259953
Synonyms:
CHEMBL499847 | bakuchicin
Type:
Small organic molecule
Emp. Form.:
C11H6O3
Mol. Mass.:
186.1635
SMILES:
O=c1ccc2c3occc3ccc2o1
: