Target
Amine oxidase [flavin-containing] B
Ligand
BDBM50259953
Substrate
Meas. Tech.
ChEMBL_1921316 (CHEMBL4424161)
IC50
5440±n/a nM
Citation
 Baek, SCKang, MGPark, JELee, JPLee, HRyu, HWPark, CMPark, DCho, MLOh, SRKim, H Osthenol, a prenylated coumarin, as a monoamine oxidase A inhibitor with high selectivity. Bioorg Med Chem Lett 29:839-843 (2019)  
Target
Name:
Amine oxidase [flavin-containing] B
Synonyms:
AOFB_HUMAN MAOB Monoamine oxidase type B (MAO B) Monoamine oxidase type B (MAOB)
Type:
Protein
Mol. Mass.:
58768.76
Organism:
Homo sapiens (Human)
Description:
P27338
Residue:
520
  
Inhibitor
Name:
BDBM50259953
Synonyms:
CHEMBL499847 | bakuchicin
Type:
Small organic molecule
Emp. Form.:
C11H6O3
Mol. Mass.:
186.1635
SMILES:
O=c1ccc2c3occc3ccc2o1
: