Target
Probable global transcription activator SNF2L2
Ligand
BDBM310898
Substrate
Meas. Tech.
ChEMBL_1922918 (CHEMBL4425874)
IC50
6700±n/a nM
Citation
 Crawford, TDTsui, VFlynn, EMWang, STaylor, AMCôté, AAudia, JEBeresini, MHBurdick, DJCummings, RDakin, LADuplessis, MGood, ACHewitt, MCHuang, HRJayaram, HKiefer, JRJiang, YMurray, JNasveschuk, CGPardo, EPoy, FRomero, FATang, YWang, JXu, ZZawadzke, LEZhu, XAlbrecht, BKMagnuson, SRBellon, SCochran, AG Diving into the Water: Inducible Binding Conformations for BRD4, TAF1(2), BRD9, and CECR2 Bromodomains. J Med Chem 59:5391-402 (2016)  
Target
Name:
Probable global transcription activator SNF2L2
Synonyms:
ATP-dependent helicase SMARCA2 BRG1-associated factor 190B Protein brahma homolog SMCA2_HUMAN SNF2A SWI/SNF-related matrix-associated actin-dependent regulator of chromatin subfamily A member 2 | hBRM
Type:
Enzyme Catalytic Domain
Mol. Mass.:
181290.91
Organism:
Homo sapiens (Human)
Description:
P51531
Residue:
1590
  
Inhibitor
Name:
BDBM310898
Synonyms:
N,N-dimethyl-3-(6-methyl-7-oxo-1H-pyrrolo[2,3-c]pyridin-4-yl)benzamide | US10150767, Example 22
Type:
Small organic molecule
Emp. Form.:
C17H17N3O2
Mol. Mass.:
295.3358
SMILES:
CN(C)C(=O)c1cccc(c1)-c1cn(C)c(=O)c2[nH]ccc12
: