Target
Cannabinoid receptor 2
Ligand
BDBM50532778
Substrate
Meas. Tech.
ChEMBL_1923908 (CHEMBL4426864)
EC50
9.0±n/a nM
Citation
 Kulkarni, SNikas, SPSharma, RJiang, SParonis, CALeonard, MZZhang, BHonrao, CMallipeddi, SRaghav, JGBenchama, OJärbe, TUBergman, JMakriyannis, A Novel C-Ring-Hydroxy-Substituted Controlled Deactivation Cannabinergic Analogues. J Med Chem 59:6903-19 (2016)  
Target
Name:
Cannabinoid receptor 2
Synonyms:
CANNABINOID CB2 CB2 CB2B CNR2_HUMAN Cannabinoid CB2 receptor Cannabinoid receptor 2 (CB2R) | hCB2
Type:
G Protein-Coupled Receptor (GPCR)
Mol. Mass.:
39690.94
Organism:
Homo sapiens (Human)
Description:
P34972
Residue:
360
  
Inhibitor
Name:
BDBM50532778
Synonyms:
CHEMBL4465566 | US10882838, Example 3.6
Type:
Small organic molecule
Emp. Form.:
C23H34O5
Mol. Mass.:
390.5131
SMILES:
[H][C@@]12C[C@H](O)CC[C@@]1([H])C(C)(C)Oc1cc(cc(O)c21)C(C)(C)C(=O)OCCCC
: