Target
Atrial natriuretic peptide receptor 1
Ligand
BDBM50091755
Substrate
Meas. Tech.
ChEBML_34995
Ki
539±n/a nM
Citation
 Veale, CAAlford, VCAharony, DBanville, DLBialecki, RABrown, FJDamewood, JRDantzman, CLEdwards, PDJacobs, RTMauger, RCMurphy, MMPalmer, WPine, KKRumsey, WLGarcia-Davenport, LEShaw, ASteelman, GBSurian, JMVacek, EP The discovery of non-basic atrial natriuretic peptide clearance receptor antagonists. Part 1. Bioorg Med Chem Lett 10:1949-52 (2001)  
Target
Name:
Atrial natriuretic peptide receptor 1
Synonyms:
ANP-A ANPRA_HUMAN Atrial natriuretic peptide receptor GC-A NPR-A | NPR1
Type:
PROTEIN
Mol. Mass.:
118919.35
Organism:
Homo sapiens (Human)
Description:
ChEMBL_700223
Residue:
1061
  
Inhibitor
Name:
BDBM50091755
Synonyms:
(S)-N-[(S)-4-Guanidino-1-((S)-2-methyl-pentylcarbamoyl)-butyl]-3-[(2S,3S)-2-((S)-5-guanidino-2-phenylacetylamino-pentanoylamino)-3-methyl-pentanoylamino]-succinamic acid | CHEMBL435181
Type:
Small organic molecule
Emp. Form.:
C36H61N11O7
Mol. Mass.:
759.939
SMILES:
CCC[C@H](C)CNC(=O)[C@H](CCCNC(N)=N)NC(=O)[C@H](CC(O)=O)NC(=O)[C@@H](NC(=O)[C@H](CCCNC(N)=N)NC(=O)Cc1ccccc1)[C@@H](C)CC
: