Target
NACHT, LRR and PYD domains-containing protein 3
Ligand
BDBM50538395
Substrate
Meas. Tech.
ChEMBL_1972751 (CHEMBL4605569)
IC50
>1000±n/a nM
Citation
 Agarwal, SSasane, SShah, HAPethani, JPDeshmukh, PVyas, VIyer, PBhavsar, HViswanathan, KBandyopadhyay, DGiri, PMahapatra, JChatterjee, AJain, MRSharma, R Discovery of  ACS Med Chem Lett 11:414-418 (2020)  
Target
Name:
NACHT, LRR and PYD domains-containing protein 3
Synonyms:
C1orf7 NALP3 NLRP3 protein PYPAF1
Type:
Enzyme Catalytic Domain
Mol. Mass.:
118173.88
Organism:
Homo sapiens (Human)
Description:
Q96P20
Residue:
1036
  
Inhibitor
Name:
BDBM50538395
Synonyms:
CHEMBL4634472
Type:
Small organic molecule
Emp. Form.:
C19H21N2O3P
Mol. Mass.:
356.3554
SMILES:
OP(=O)(NC(=O)Nc1c2CCCc2cc2CCCc12)c1ccccc1
: