Target
NACHT, LRR and PYD domains-containing protein 3
Ligand
BDBM50538399
Substrate
Meas. Tech.
ChEMBL_1972751 (CHEMBL4605569)
IC50
>1000±n/a nM
Citation
 Agarwal, SSasane, SShah, HAPethani, JPDeshmukh, PVyas, VIyer, PBhavsar, HViswanathan, KBandyopadhyay, DGiri, PMahapatra, JChatterjee, AJain, MRSharma, R Discovery of  ACS Med Chem Lett 11:414-418 (2020)  
Target
Name:
NACHT, LRR and PYD domains-containing protein 3
Synonyms:
C1orf7 NALP3 NLRP3 protein PYPAF1
Type:
Enzyme Catalytic Domain
Mol. Mass.:
118173.88
Organism:
Homo sapiens (Human)
Description:
Q96P20
Residue:
1036
  
Inhibitor
Name:
BDBM50538399
Synonyms:
CHEMBL4643011
Type:
Small organic molecule
Emp. Form.:
C21H23NO4S
Mol. Mass.:
385.477
SMILES:
Cc1ccc(cc1)S(=O)(=O)NC(=O)C(O)c1c2CCCc2cc2CCCc12
: