Target
NACHT, LRR and PYD domains-containing protein 3
Ligand
BDBM50538416
Substrate
Meas. Tech.
ChEMBL_1972751 (CHEMBL4605569)
IC50
5.3±n/a nM
Citation
 Agarwal, SSasane, SShah, HAPethani, JPDeshmukh, PVyas, VIyer, PBhavsar, HViswanathan, KBandyopadhyay, DGiri, PMahapatra, JChatterjee, AJain, MRSharma, R Discovery of  ACS Med Chem Lett 11:414-418 (2020)  
Target
Name:
NACHT, LRR and PYD domains-containing protein 3
Synonyms:
C1orf7 NALP3 NLRP3 protein PYPAF1
Type:
Enzyme Catalytic Domain
Mol. Mass.:
118173.88
Organism:
Homo sapiens (Human)
Description:
Q96P20
Residue:
1036
  
Inhibitor
Name:
BDBM50538416
Synonyms:
CHEMBL4644835 | US11236045, Example 25
Type:
Small organic molecule
Emp. Form.:
C21H21FN4O2S
Mol. Mass.:
412.48
SMILES:
Cc1ccc(cc1F)S(=O)(NC(=O)Nc1c2CCCc2cc2CCCc12)=NC#N
: