Target
Transcription activator BRG1
Ligand
BDBM50539801
Substrate
Meas. Tech.
ChEMBL_1979377 (CHEMBL4612512)
Kd
<1.000000±n/a nM
Citation
 Li, YZhao, JGutgesell, LMShen, ZRatia, KDye, KDubrovskyi, OZhao, HHuang, FTonetti, DAThatcher, GRJXiong, R Novel Pyrrolopyridone Bromodomain and Extra-Terminal Motif (BET) Inhibitors Effective in Endocrine-Resistant ER+ Breast Cancer with Acquired Resistance to Fulvestrant and Palbociclib. J Med Chem 63:7186-7210 (2020)  
Target
Name:
Transcription activator BRG1
Synonyms:
ATP-dependent helicase SMARCA4 BRG1 Mitotic growth and transcription activator Protein brahma homolog 1 SMCA4_HUMAN SNF2B SWI/SNF-related matrix-associated actin-dependent regulator of chromatin subfamily A member 4
Type:
PROTEIN
Mol. Mass.:
184666.66
Organism:
Homo sapiens (Human)
Description:
ChEMBL_107968
Residue:
1647
  
Inhibitor
Name:
BDBM50539801
Synonyms:
CHEMBL4648912 | US11840533, Compound 70
Type:
Small organic molecule
Emp. Form.:
C30H28N6O3S
Mol. Mass.:
552.647
SMILES:
CCS(=O)(=O)Nc1cc(cc2n(ccc12)C(C)(c1ccccn1)c1ccccn1)-c1cn(C)c2c1cc[nH]c2=O
: