Target
Cyclin-dependent kinase 3/G1/S-specific cyclin-E1
Ligand
BDBM50539904
Substrate
Meas. Tech.
ChEMBL_1979636 (CHEMBL4612771)
IC50
366±n/a nM
Citation
 Liu, YHao, MLeggett, ALGao, YFicarro, SBChe, JHe, ZOlson, CMMarto, JAKwiatkowski, NPZhang, TGray, NS Discovery of MFH290: A Potent and Highly Selective Covalent Inhibitor for Cyclin-Dependent Kinase 12/13. J Med Chem 63:6708-6726 (2020)  
Target
Name:
Cyclin-dependent kinase 3/G1/S-specific cyclin-E1
Synonyms:
CDK3/Cyclin E | CDK3/E
Type:
Protein
Mol. Mass.:
Description:
Components:
This complex has 2 components.
Component 1
Name:
Cyclin-dependent kinase 3
Synonyms:
CDK3 CDK3_HUMAN Cyclin-dependent kinase 3 | Cyclin-dependent kinase 3 (CDK3)
Type:
Enzyme
Mol. Mass.:
35053.88
Organism:
Homo sapiens (Human)
Description:
Q00526
Residue:
305
  
Component 2
Name:
G1/S-specific cyclin-E1
Synonyms:
CCNE CCNE1_HUMAN
Type:
Enzyme Subunit
Mol. Mass.:
47073.17
Organism:
Homo sapiens (Human)
Description:
Residue:
410
  
Inhibitor
Name:
BDBM50539904
Synonyms:
CHEMBL4647764
Type:
Small organic molecule
Emp. Form.:
C26H31N5O3S2
Mol. Mass.:
525.686
SMILES:
CC(C)(C)c1cnc(CSc2cnc(N[C@@H]3CCCN(C3)C(=O)c3ccc(NC(=O)C=C)cc3)s2)o1
: