Target
5-hydroxytryptamine receptor 1A
Ligand
BDBM50087036
Substrate
Meas. Tech.
ChEMBL_948 (CHEMBL616127)
Ki
41±n/a nM
Citation
 Linnanen, TBrisander, MMohell, NJohansson, AM Serotonergic and dopaminergic activities of rigidified (R)-aporphine derivatives. Bioorg Med Chem Lett 11:367-70 (2001)  
Target
Name:
5-hydroxytryptamine receptor 1A
Synonyms:
5-HT-1A 5-hydroxytryptamine receptor 1A (5-HT-1A) ADRB2RL1 Dopamine D2 receptor and serotonin 1a receptor HTR1A | Serotonin receptor 1A
Type:
Mol. Mass.:
46122.49
Organism:
Homo sapiens (Human)
Description:
Residue:
422
  
Inhibitor
Name:
BDBM50087036
Synonyms:
6-Methyl-1,5,5a,6,7,8-hexahydro-6-aza-benzo[mno]aceanthrylene | CHEMBL284586
Type:
Small organic molecule
Emp. Form.:
C18H17N
Mol. Mass.:
247.3343
SMILES:
CN1CCc2ccc3Cc4cccc5C[C@@H]1c2c3-c45
: