Target
5-hydroxytryptamine receptor 7
Ligand
BDBM29644
Substrate
Meas. Tech.
ChEMBL_3756 (CHEMBL620756)
Ki
188±n/a nM
Citation
 Linnanen, TBrisander, MMohell, NJohansson, AM Serotonergic and dopaminergic activities of rigidified (R)-aporphine derivatives. Bioorg Med Chem Lett 11:367-70 (2001)  
Target
Name:
5-hydroxytryptamine receptor 7
Synonyms:
5-HT-7 5-HT7 5-HT7S 5-hydroxytryptamine receptor 7 5HT7R_RAT GPRFO Serotonin (5-HT) receptor | Serotonin Receptor 7
Type:
G Protein-Coupled Receptor (GPCR)
Mol. Mass.:
49852.62
Organism:
Rattus norvegicus (rat)
Description:
Rat cloned 5-HT7R.
Residue:
448
  
Inhibitor
Name:
BDBM29644
Synonyms:
(6aR)-6-methyl-5,6,6a,7-tetrahydro-4H-dibenzo[de,g]quinoline-10,11-diol;hydrate;hydrochloride APOMORPHINE HYDROCHLORIDE HEMIHYDRATE SMR000059235 | cid_6852399
Type:
Small organic molecule
Emp. Form.:
C17H17NO2
Mol. Mass.:
267.3224
SMILES:
CN1CCc2cccc-3c2[C@H]1Cc1ccc(O)c(O)c-31
: