Target
5-hydroxytryptamine receptor 1A
Ligand
BDBM50202298
Substrate
Meas. Tech.
ChEBML_948
Ki
373±n/a nM
Citation
 Linnanen, TBrisander, MMohell, NJohansson, AM Serotonergic and dopaminergic activities of rigidified (R)-aporphine derivatives. Bioorg Med Chem Lett 11:367-70 (2001)  
Target
Name:
5-hydroxytryptamine receptor 1A
Synonyms:
5-HT-1A 5-hydroxytryptamine receptor 1A (5-HT-1A) ADRB2RL1 Dopamine D2 receptor and serotonin 1a receptor HTR1A | Serotonin receptor 1A
Type:
Mol. Mass.:
46122.49
Organism:
Homo sapiens (Human)
Description:
Residue:
422
  
Inhibitor
Name:
BDBM50202298
Synonyms:
(R)-7-Methyl-1,6,6a,7,8,9-hexahydro-1,7-diaza-benzo[cd]pyren-2-one | CHEMBL253318
Type:
Small organic molecule
Emp. Form.:
C18H16N2O
Mol. Mass.:
276.3324
SMILES:
CN1CCc2ccc3[nH]c(=O)c4cccc5C[C@@H]1c2c3c45
: