Target
cGMP-specific 3',5'-cyclic phosphodiesterase
Ligand
BDBM50098220
Substrate
Meas. Tech.
ChEMBL_154561 (CHEMBL757896)
IC50
0.800000±n/a nM
Citation
 Yu, GMason, HJWu, XWang, JChong, SDorough, GHenwood, APongrac, RSeliger, LHe, BNormandin, DAdam, LKrupinski, JMacor, JE Substituted pyrazolopyridines as potent and selective PDE5 inhibitors: potential agents for treatment of erectile dysfunction. J Med Chem 44:1025-7 (2001)  
Target
Name:
cGMP-specific 3',5'-cyclic phosphodiesterase
Synonyms:
3',5'-cyclic phosphodiesterase PDE5 PDE5A_HUMAN Phosphodiesterase 5 (PDE5) Phosphodiesterase 5A (PDE5A) cGMP-specific 3',5'-cyclic phosphodiesterase
Type:
Protein
Mol. Mass.:
99975.83
Organism:
Homo sapiens (Human)
Description:
O76074
Residue:
875
  
Inhibitor
Name:
BDBM50098220
Synonyms:
4-(3-Chloro-4-methoxy-benzylamino)-1-ethyl-1H-pyrazolo[3,4-b]pyridine-5-carboxylic acid (pyridin-4-ylmethyl)-amide CHEMBL7868
Type:
Small organic molecule
Emp. Form.:
C23H23ClN6O2
Mol. Mass.:
450.921
SMILES:
CCn1ncc2c(NCc3ccc(OC)c(Cl)c3)c(cnc12)C(=O)NCc1ccncc1
: