Target
Activin receptor type-1
Ligand
BDBM50528194
Substrate
Meas. Tech.
ChEMBL_1992450 (CHEMBL4626185)
IC50
16±n/a nM
Citation
 Smil, DWong, JFWilliams, EPAdamson, RJHowarth, AMcLeod, DAMamai, AKim, SWilson, BJKiyota, TAman, AOwen, JPoda, GHoriuchi, KYKuznetsova, EMa, HHamblin, JNCramp, SRoberts, OGEdwards, AMUehling, DAl-Awar, RBullock, ANO'Meara, JAIsaac, MB Leveraging an Open Science Drug Discovery Model to Develop CNS-Penetrant ALK2 Inhibitors for the Treatment of Diffuse Intrinsic Pontine Glioma. J Med Chem 63:10061-10085 (2020)  
Target
Name:
Activin receptor type-1
Synonyms:
2.7.11.30 ACVR1 ACVRLK2 ALK2/ACVR1 Activin receptor-like kinase 2 Activin receptor-like kinase 2 (ALK2/ACVR1) SKR1 TGF-B superfamily receptor type I | TSR-I
Type:
Mol. Mass.:
57158.32
Organism:
Homo sapiens (Human)
Description:
Residue:
509
  
Inhibitor
Name:
BDBM50528194
Synonyms:
CHEMBL4517408
Type:
Small organic molecule
Emp. Form.:
C25H29N3O3
Mol. Mass.:
419.5161
SMILES:
COc1cc(cc(OC)c1OC)-c1cncc(c1C)-c1ccc(cc1)N1CCNCC1
: