Target
Coagulation factor X
Ligand
BDBM50103666
Substrate
Meas. Tech.
ChEBML_48973
IC50
0.180000±n/a nM
Citation
 Su, TWu, YDoughan, BKane-Maguire, KMarlowe, CKKanter, JPWoolfrey, JHuang, BWong, PSinha, UPark, GMalinowski, JHollenbach, SScarborough, RMZhu, BY Design and synthesis of glycolic and mandelic acid derivatives as factor Xa inhibitors. Bioorg Med Chem Lett 11:2279-82 (2001)  
Target
Name:
Coagulation factor X
Synonyms:
Activated coagulation factor X (FXa) Coagulation factor X precursor F10 Factor X heavy chain Factor Xa Stuart-Prower factor
Type:
Enzyme
Mol. Mass.:
54726.60
Organism:
Homo sapiens (Human)
Description:
Residue:
488
  
Inhibitor
Name:
BDBM50103666
Synonyms:
2-(3-Carbamimidoyl-phenoxy)-2-phenyl-N-[4-(pyrrolidine-1-carbonyl)-phenyl]-acetamide | CHEMBL305828
Type:
Small organic molecule
Emp. Form.:
C26H26N4O3
Mol. Mass.:
442.5096
SMILES:
NC(=N)c1cccc(OC(C(=O)Nc2ccc(cc2)C(=O)N2CCCC2)c2ccccc2)c1
: