Target
Glutamate receptor 4
Ligand
BDBM50107595
Substrate
Meas. Tech.
ChEMBL_72851 (CHEMBL680876)
Ki
1756±n/a nM
Citation
 Campiani, GMorelli, ENacci, VFattorusso, CRamunno, ANovellino, EGreenwood, JLiljefors, TGriffiths, RSinclair, CReavy, HKristensen, ASPickering, DSSchousboe, ACagnotto, AFumagalli, EMennini, T Characterization of the 1H-cyclopentapyrimidine-2,4(1H,3H)-dione derivative (S)-CPW399 as a novel, potent, and subtype-selective AMPA receptor full agonist with partial desensitization properties. J Med Chem 44:4501-4 (2001)  
Target
Name:
Glutamate receptor 4
Synonyms:
GRIA4_RAT Glutamate receptor ionotropic, AMPA 4 Gria4
Type:
PROTEIN
Mol. Mass.:
100766.57
Organism:
Rattus norvegicus
Description:
ChEMBL_539474
Residue:
902
  
Inhibitor
Name:
BDBM50107595
Synonyms:
(S)-1-(2-Amino-2-carboxyethyl)-6,7-dihydro-1H-cyclopenta[d]-pyrimidin-2,4(1H,3H)dione 2-Amino-3-(2,4-dioxo-2,3,4,5,6,7-hexahydro-cyclopentapyrimidin-1-yl)-propionic acid | CHEMBL337577
Type:
Small organic molecule
Emp. Form.:
C10H13N3O4
Mol. Mass.:
239.2279
SMILES:
N[C@@H](Cn1c2CCCc2c(=O)[nH]c1=O)C(O)=O
: